Information card for entry 7237721
Chemical name | 4e |
Formula | C16 H15 B Br F2 N3 O |
Calculated formula | C16 H15 B Br F2 N3 O |
Title of publication | AIE-active difluoroboronated acylhydrozone dyes (BOAHY) emitting across the entire visible region and their photo-switching properties |
Authors of publication | Yu, Changjiang; Hao, Erhong; Fang, Xingbao; Wu, Qinghua; Wang, Long; Li, Jiahua; Xu, Linli; Jiao, Lijuan; Wong, Wai-Yeung |
Journal of publication | Journal of Materials Chemistry C |
Year of publication | 2019 |
Journal volume | 7 |
Journal issue | 11 |
Pages of publication | 3269 |
a | 7.3547 ± 0.0005 Å |
b | 25.1921 ± 0.0015 Å |
c | 9.1335 ± 0.0005 Å |
α | 90° |
β | 106.823 ± 0.002° |
γ | 90° |
Cell volume | 1619.84 ± 0.17 Å3 |
Cell temperature | 293 ± 2 K |
Ambient diffraction temperature | 293 ± 2 K |
Number of distinct elements | 7 |
Space group number | 14 |
Hermann-Mauguin space group symbol | P 1 21/c 1 |
Hall space group symbol | -P 2ybc |
Residual factor for all reflections | 0.0968 |
Residual factor for significantly intense reflections | 0.0545 |
Weighted residual factors for significantly intense reflections | 0.0956 |
Weighted residual factors for all reflections included in the refinement | 0.1093 |
Goodness-of-fit parameter for all reflections included in the refinement | 1.131 |
Diffraction radiation probe | x-ray |
Diffraction radiation wavelength | 0.71073 Å |
Diffraction radiation type | MoKα |