Information card for entry 7237722
Chemical name | [Pb3Br4][C8H14O4] |
Formula | C4 H6 Br3 O2 Pb2 |
Calculated formula | C4 H6 Br3 O2 Pb2 |
Title of publication | Enhanced intrinsic white-light emission upon near-UV excitation by crystal engineering of cationic lead bromide layered materials |
Authors of publication | Yang, Huimin; Yin, Jinlin; Xu, Xiaoxiang; Fei, Honghan |
Journal of publication | Journal of Materials Chemistry C |
Year of publication | 2019 |
Journal volume | 7 |
Journal issue | 23 |
Pages of publication | 7090 |
a | 14.574 ± 0.005 Å |
b | 8.493 ± 0.003 Å |
c | 8.347 ± 0.003 Å |
α | 90° |
β | 90.753 ± 0.014° |
γ | 90° |
Cell volume | 1033.1 ± 0.6 Å3 |
Cell temperature | 273 ± 2 K |
Ambient diffraction temperature | 273 ± 2 K |
Number of distinct elements | 5 |
Space group number | 14 |
Hermann-Mauguin space group symbol | P 1 21/c 1 |
Hall space group symbol | -P 2ybc |
Residual factor for all reflections | 0.111 |
Residual factor for significantly intense reflections | 0.0885 |
Weighted residual factors for significantly intense reflections | 0.2395 |
Weighted residual factors for all reflections included in the refinement | 0.2628 |
Goodness-of-fit parameter for all reflections included in the refinement | 1.075 |
Diffraction radiation wavelength | 0.71073 Å |
Diffraction radiation type | MoKα |