Information card for entry 7239661
Common name | cucurbit[6]uril/dopamine complex |
Formula | C44 H76 Cl N25 O28 |
Calculated formula | C44 H48 Cl N25 O27.916 |
Title of publication | Solution-mediated and single-crystal to single-crystal transformations of cucurbit[6]uril host‒guest complexes with dopamine |
Authors of publication | Danylyuk, Oksana; Worzakowska, Marta; Osypiuk-Tomasik, Joanna; Sashuk, Volodymyr; Kedra-Krolik, Karolina |
Journal of publication | CrystEngComm |
Year of publication | 2020 |
Journal volume | 22 |
Journal issue | 4 |
Pages of publication | 634 - 638 |
a | 50.711 ± 0.002 Å |
b | 50.711 ± 0.002 Å |
c | 12.5325 ± 0.0008 Å |
α | 90° |
β | 90° |
γ | 120° |
Cell volume | 27911 ± 2 Å3 |
Cell temperature | 100 ± 0.1 K |
Ambient diffraction temperature | 100 ± 0.1 K |
Number of distinct elements | 5 |
Space group number | 148 |
Hermann-Mauguin space group symbol | R -3 :H |
Hall space group symbol | -R 3 |
Residual factor for all reflections | 0.1104 |
Residual factor for significantly intense reflections | 0.0938 |
Weighted residual factors for significantly intense reflections | 0.2792 |
Weighted residual factors for all reflections included in the refinement | 0.3057 |
Goodness-of-fit parameter for all reflections included in the refinement | 1.105 |
Diffraction radiation wavelength | 1.54184 Å |
Diffraction radiation type | CuKα |