Information card for entry 7239662
Common name | 'cucurbit[6]uril/dopamine complex - dried in air' |
Formula | C44 H62.67 Cl N25 O21.33 |
Calculated formula | C44 H48 Cl N25 O20.9493 |
Title of publication | Solution-mediated and single-crystal to single-crystal transformations of cucurbit[6]uril host‒guest complexes with dopamine |
Authors of publication | Danylyuk, Oksana; Worzakowska, Marta; Osypiuk-Tomasik, Joanna; Sashuk, Volodymyr; Kedra-Krolik, Karolina |
Journal of publication | CrystEngComm |
Year of publication | 2020 |
Journal volume | 22 |
Journal issue | 4 |
Pages of publication | 634 - 638 |
a | 48.442 ± 0.002 Å |
b | 48.442 ± 0.002 Å |
c | 12.4117 ± 0.0004 Å |
α | 90° |
β | 90° |
γ | 120° |
Cell volume | 25223.5 ± 1.7 Å3 |
Cell temperature | 100 ± 0.1 K |
Ambient diffraction temperature | 100 ± 0.1 K |
Number of distinct elements | 5 |
Space group number | 148 |
Hermann-Mauguin space group symbol | R -3 :H |
Hall space group symbol | -R 3 |
Residual factor for all reflections | 0.1379 |
Residual factor for significantly intense reflections | 0.1165 |
Weighted residual factors for significantly intense reflections | 0.3189 |
Weighted residual factors for all reflections included in the refinement | 0.3422 |
Goodness-of-fit parameter for all reflections included in the refinement | 1.129 |
Diffraction radiation wavelength | 1.54184 Å |
Diffraction radiation type | CuKα |