Information card for entry 7239665
Formula | C21 H16 Cd N6 O2 |
Calculated formula | C21 H16 Cd N6 O2 |
Title of publication | Three new coordination polymers based on bis(4-(4H-1,2,4-triazol-4-yl)phenyl)methane: syntheses, structures, multiresponsive luminescent sensitive detection for antibiotics and pesticides, and antitumor activities |
Authors of publication | Wang, Chang-Sheng; Huang, Qi; Wang, Xia; Zhang, Yu-Tong; Ma, Dong-Sheng; Yu, Ying-Hui; Gao, Jin-Sheng |
Journal of publication | RSC Advances |
Year of publication | 2019 |
Journal volume | 9 |
Journal issue | 72 |
Pages of publication | 42272 |
a | 16.6171 ± 0.0005 Å |
b | 8.1566 ± 0.0002 Å |
c | 20.3047 ± 0.0006 Å |
α | 90° |
β | 110.44 ± 0.001° |
γ | 90° |
Cell volume | 2578.8 ± 0.13 Å3 |
Cell temperature | 98 ± 2 K |
Ambient diffraction temperature | 98 ± 2 K |
Number of distinct elements | 5 |
Space group number | 14 |
Hermann-Mauguin space group symbol | P 1 21/c 1 |
Hall space group symbol | -P 2ybc |
Residual factor for all reflections | 0.0311 |
Residual factor for significantly intense reflections | 0.0268 |
Weighted residual factors for significantly intense reflections | 0.0776 |
Weighted residual factors for all reflections included in the refinement | 0.0803 |
Goodness-of-fit parameter for all reflections included in the refinement | 1.06 |
Diffraction radiation wavelength | 0.71073 Å |
Diffraction radiation type | MoKα |