Information card for entry 7239664
Formula | C36 H31 Ag2 Mo4 N13 O13 |
Calculated formula | C36 H31 Ag2 Mo4 N13 O13 |
Title of publication | Three new coordination polymers based on bis(4-(4H-1,2,4-triazol-4-yl)phenyl)methane: syntheses, structures, multiresponsive luminescent sensitive detection for antibiotics and pesticides, and antitumor activities |
Authors of publication | Wang, Chang-Sheng; Huang, Qi; Wang, Xia; Zhang, Yu-Tong; Ma, Dong-Sheng; Yu, Ying-Hui; Gao, Jin-Sheng |
Journal of publication | RSC Advances |
Year of publication | 2019 |
Journal volume | 9 |
Journal issue | 72 |
Pages of publication | 42272 |
a | 24.1943 ± 0.0009 Å |
b | 23.8328 ± 0.0009 Å |
c | 15.221 ± 0.0006 Å |
α | 90° |
β | 102.567 ± 0.002° |
γ | 90° |
Cell volume | 8566.4 ± 0.6 Å3 |
Cell temperature | 302 ± 2 K |
Ambient diffraction temperature | 302 ± 2 K |
Number of distinct elements | 6 |
Space group number | 15 |
Hermann-Mauguin space group symbol | C 1 2/c 1 |
Hall space group symbol | -C 2yc |
Residual factor for all reflections | 0.1479 |
Residual factor for significantly intense reflections | 0.0855 |
Weighted residual factors for significantly intense reflections | 0.1978 |
Weighted residual factors for all reflections included in the refinement | 0.2603 |
Goodness-of-fit parameter for all reflections included in the refinement | 1.09 |
Diffraction radiation wavelength | 0.71073 Å |
Diffraction radiation type | MoKα |