Information card for entry 7239753
Formula | C42 H28 Cd2 N4 O8 |
Calculated formula | C42 H28 Cd2 N4 O8 |
Title of publication | A dual-responsive luminescent sensor based on a water-stable Cd(ii)-MOF for the highly selective and sensitive detection of acetylacetone and Cr2O72− in aqueous solutions |
Authors of publication | Yang, Ying-Jie; Li, Yue-Hua; Liu, Dong; Cui, Guang-Hua |
Journal of publication | CrystEngComm |
Year of publication | 2020 |
Journal volume | 22 |
Journal issue | 7 |
Pages of publication | 1166 - 1175 |
a | 20.5773 ± 0.0013 Å |
b | 7.6357 ± 0.0005 Å |
c | 20.5774 ± 0.0006 Å |
α | 90° |
β | 94.06 ± 0.01° |
γ | 90° |
Cell volume | 3225.1 ± 0.3 Å3 |
Cell temperature | 296 ± 2 K |
Ambient diffraction temperature | 296 ± 2 K |
Number of distinct elements | 5 |
Space group number | 14 |
Hermann-Mauguin space group symbol | P 1 21/n 1 |
Hall space group symbol | -P 2yn |
Residual factor for all reflections | 0.0213 |
Residual factor for significantly intense reflections | 0.0211 |
Weighted residual factors for significantly intense reflections | 0.0565 |
Weighted residual factors for all reflections included in the refinement | 0.0566 |
Goodness-of-fit parameter for all reflections included in the refinement | 1.027 |
Diffraction radiation wavelength | 0.71073 Å |
Diffraction radiation type | MoKα |