Information card for entry 7239754
Formula | C32 H26 Cd N4 O4 |
Calculated formula | C32 H26 Cd N4 O4 |
Title of publication | A dual-responsive luminescent sensor based on a water-stable Cd(ii)-MOF for the highly selective and sensitive detection of acetylacetone and Cr2O72− in aqueous solutions |
Authors of publication | Yang, Ying-Jie; Li, Yue-Hua; Liu, Dong; Cui, Guang-Hua |
Journal of publication | CrystEngComm |
Year of publication | 2020 |
Journal volume | 22 |
Journal issue | 7 |
Pages of publication | 1166 - 1175 |
a | 15.5031 ± 0.0009 Å |
b | 10.5717 ± 0.0006 Å |
c | 18.4527 ± 0.0011 Å |
α | 90° |
β | 107.028 ± 0.001° |
γ | 90° |
Cell volume | 2891.7 ± 0.3 Å3 |
Cell temperature | 296 ± 2 K |
Ambient diffraction temperature | 296 ± 2 K |
Number of distinct elements | 5 |
Space group number | 14 |
Hermann-Mauguin space group symbol | P 1 21/c 1 |
Hall space group symbol | -P 2ybc |
Residual factor for all reflections | 0.0335 |
Residual factor for significantly intense reflections | 0.0267 |
Weighted residual factors for significantly intense reflections | 0.0887 |
Weighted residual factors for all reflections included in the refinement | 0.0996 |
Goodness-of-fit parameter for all reflections included in the refinement | 1.079 |
Diffraction radiation wavelength | 0.71073 Å |
Diffraction radiation type | MoKα |