Information card for entry 7239775
Chemical name | Fc Trip |
Formula | C30 H24 Fe |
Calculated formula | C30 H24 Fe |
Title of publication | The borderline: exploring the structural landscape of triptycene in cocrystallization with ferrocene |
Authors of publication | Singh, Ajeet; Torubaev, Yury; Ansari, Shagufi N.; Singh, Sandip K.; Mobin, Shaikh M.; Mathur, Pradeep |
Journal of publication | CrystEngComm |
Year of publication | 2020 |
Journal volume | 22 |
Journal issue | 8 |
Pages of publication | 1314 - 1320 |
a | 9.4217 ± 0.0005 Å |
b | 10.3198 ± 0.0006 Å |
c | 13.0913 ± 0.0006 Å |
α | 67.835 ± 0.005° |
β | 71.685 ± 0.005° |
γ | 86.556 ± 0.005° |
Cell volume | 1116.61 ± 0.12 Å3 |
Cell temperature | 293 K |
Ambient diffraction temperature | 293 K |
Number of distinct elements | 3 |
Space group number | 2 |
Hermann-Mauguin space group symbol | P -1 |
Hall space group symbol | -P 1 |
Residual factor for all reflections | 0.0733 |
Residual factor for significantly intense reflections | 0.0538 |
Weighted residual factors for significantly intense reflections | 0.1391 |
Weighted residual factors for all reflections included in the refinement | 0.1533 |
Goodness-of-fit parameter for all reflections included in the refinement | 1.028 |
Diffraction radiation probe | x-ray |
Diffraction radiation wavelength | 0.71073 Å |
Diffraction radiation type | MoKα |