Information card for entry 7239776
Chemical name | FCC2trip |
Formula | C64 H46 Fe2 |
Calculated formula | C64 H46 Fe2 |
Title of publication | The borderline: exploring the structural landscape of triptycene in cocrystallization with ferrocene |
Authors of publication | Singh, Ajeet; Torubaev, Yury; Ansari, Shagufi N.; Singh, Sandip K.; Mobin, Shaikh M.; Mathur, Pradeep |
Journal of publication | CrystEngComm |
Year of publication | 2020 |
Journal volume | 22 |
Journal issue | 8 |
Pages of publication | 1314 - 1320 |
a | 13.332 ± 0.0015 Å |
b | 13.4018 ± 0.0012 Å |
c | 16.138 ± 0.002 Å |
α | 95.029 ± 0.009° |
β | 105.145 ± 0.011° |
γ | 119.521 ± 0.01° |
Cell volume | 2340.2 ± 0.6 Å3 |
Cell temperature | 298 K |
Ambient diffraction temperature | 298 K |
Number of distinct elements | 3 |
Space group number | 2 |
Hermann-Mauguin space group symbol | P -1 |
Hall space group symbol | -P 1 |
Residual factor for all reflections | 0.2107 |
Residual factor for significantly intense reflections | 0.0914 |
Weighted residual factors for significantly intense reflections | 0.1986 |
Weighted residual factors for all reflections included in the refinement | 0.2736 |
Goodness-of-fit parameter for all reflections included in the refinement | 1.021 |
Diffraction radiation wavelength | 0.71073 Å |
Diffraction radiation type | MoKα |