Information card for entry 7239779
Chemical name | TripPCPfc |
Formula | C48 H38 Fe |
Calculated formula | C48 H38 Fe |
Title of publication | The borderline: exploring the structural landscape of triptycene in cocrystallization with ferrocene |
Authors of publication | Singh, Ajeet; Torubaev, Yury; Ansari, Shagufi N.; Singh, Sandip K.; Mobin, Shaikh M.; Mathur, Pradeep |
Journal of publication | CrystEngComm |
Year of publication | 2020 |
Journal volume | 22 |
Journal issue | 8 |
Pages of publication | 1314 - 1320 |
a | 7.95 ± 0.0004 Å |
b | 28.507 ± 0.002 Å |
c | 15.5007 ± 0.0008 Å |
α | 90° |
β | 104.262 ± 0.005° |
γ | 90° |
Cell volume | 3404.7 ± 0.4 Å3 |
Cell temperature | 293 ± 2 K |
Ambient diffraction temperature | 293 ± 2 K |
Number of distinct elements | 3 |
Space group number | 14 |
Hermann-Mauguin space group symbol | P 1 21/c 1 |
Hall space group symbol | -P 2ybc |
Residual factor for all reflections | 0.1747 |
Residual factor for significantly intense reflections | 0.1158 |
Weighted residual factors for significantly intense reflections | 0.3075 |
Weighted residual factors for all reflections included in the refinement | 0.3614 |
Goodness-of-fit parameter for all reflections included in the refinement | 1.027 |
Diffraction radiation probe | x-ray |
Diffraction radiation wavelength | 1.54184 Å |
Diffraction radiation type | CuKα |