Information card for entry 7239780
Formula | C18 H18 Cl2 Hg N2 O4 |
Calculated formula | C18 H18 Cl2 Hg N2 O4 |
Title of publication | Crystal formation of 1D coordination polymers based on chiral, achiral and racemic 1,2-cyclohexane scaffolds |
Authors of publication | Jouaiti, Abdelaziz; Grosshans, Philippe; Kyritsakas, Nathalie; Ferlay, Sylvie; Henry, Marc; Hosseini, Mir Wais |
Journal of publication | CrystEngComm |
Year of publication | 2020 |
Journal volume | 22 |
Journal issue | 10 |
Pages of publication | 1746 - 1753 |
a | 11.324 ± 0.0009 Å |
b | 12.502 ± 0.004 Å |
c | 14.398 ± 0.004 Å |
α | 90° |
β | 90° |
γ | 90° |
Cell volume | 2038.4 ± 0.9 Å3 |
Cell temperature | 173 ± 2 K |
Ambient diffraction temperature | 173 ± 2 K |
Number of distinct elements | 6 |
Space group number | 19 |
Hermann-Mauguin space group symbol | P 21 21 21 |
Hall space group symbol | P 2ac 2ab |
Residual factor for all reflections | 0.0457 |
Residual factor for significantly intense reflections | 0.0321 |
Weighted residual factors for significantly intense reflections | 0.0551 |
Weighted residual factors for all reflections included in the refinement | 0.0588 |
Goodness-of-fit parameter for all reflections included in the refinement | 1.015 |
Diffraction radiation wavelength | 0.71073 Å |
Diffraction radiation type | MoKα |