Information card for entry 7239868
Formula | C46 H38 N3 O26 Zn5 |
Calculated formula | C46 H38 N3 O26 Zn5 |
Title of publication | A series of anionic MOFs with cluster-based, pillared-layer and rod-spacer motifs: near-sunlight white-light emission and selective dye capture |
Authors of publication | Wang, Ce; Yin, Zheng; Cheng, Zhao; Ma, Wei-Min; Li, Xi-Yao; Hu, Xiao-Ting; Shi, Rong; Chen, Ao-Wei; Ma, Yang-Min |
Journal of publication | CrystEngComm |
Year of publication | 2020 |
Journal volume | 22 |
Journal issue | 5 |
Pages of publication | 878 - 887 |
a | 30.2857 ± 0.0013 Å |
b | 16.998 ± 0.0007 Å |
c | 28.4898 ± 0.0012 Å |
α | 90° |
β | 95.403 ± 0.002° |
γ | 90° |
Cell volume | 14601.3 ± 1.1 Å3 |
Cell temperature | 293 ± 2 K |
Ambient diffraction temperature | 293 ± 2 K |
Number of distinct elements | 5 |
Space group number | 15 |
Hermann-Mauguin space group symbol | C 1 2/c 1 |
Hall space group symbol | -C 2yc |
Residual factor for all reflections | 0.181 |
Residual factor for significantly intense reflections | 0.1335 |
Weighted residual factors for significantly intense reflections | 0.3646 |
Weighted residual factors for all reflections included in the refinement | 0.3997 |
Goodness-of-fit parameter for all reflections included in the refinement | 1.054 |
Diffraction radiation wavelength | 0.71073 Å |
Diffraction radiation type | MoKα |