Information card for entry 7239869
Formula | C15 H20 Mn N2 O7 |
Calculated formula | C15 H20 Mn N2 O7 |
Title of publication | A series of anionic MOFs with cluster-based, pillared-layer and rod-spacer motifs: near-sunlight white-light emission and selective dye capture |
Authors of publication | Wang, Ce; Yin, Zheng; Cheng, Zhao; Ma, Wei-Min; Li, Xi-Yao; Hu, Xiao-Ting; Shi, Rong; Chen, Ao-Wei; Ma, Yang-Min |
Journal of publication | CrystEngComm |
Year of publication | 2020 |
Journal volume | 22 |
Journal issue | 5 |
Pages of publication | 878 - 887 |
a | 9.4648 ± 0.0003 Å |
b | 16.2782 ± 0.0006 Å |
c | 11.5458 ± 0.0004 Å |
α | 90° |
β | 97.104 ± 0.002° |
γ | 90° |
Cell volume | 1765.2 ± 0.11 Å3 |
Cell temperature | 293 ± 2 K |
Ambient diffraction temperature | 293 ± 2 K |
Number of distinct elements | 5 |
Space group number | 14 |
Hermann-Mauguin space group symbol | P 1 21/n 1 |
Hall space group symbol | -P 2yn |
Residual factor for all reflections | 0.0963 |
Residual factor for significantly intense reflections | 0.0766 |
Weighted residual factors for significantly intense reflections | 0.2293 |
Weighted residual factors for all reflections included in the refinement | 0.2451 |
Goodness-of-fit parameter for all reflections included in the refinement | 1.097 |
Diffraction radiation wavelength | 0.71073 Å |
Diffraction radiation type | MoKα |