Information card for entry 7239870
Formula | C27 H17 Cd5 O24 |
Calculated formula | C27 H17 Cd5 O24 |
Title of publication | A series of anionic MOFs with cluster-based, pillared-layer and rod-spacer motifs: near-sunlight white-light emission and selective dye capture |
Authors of publication | Wang, Ce; Yin, Zheng; Cheng, Zhao; Ma, Wei-Min; Li, Xi-Yao; Hu, Xiao-Ting; Shi, Rong; Chen, Ao-Wei; Ma, Yang-Min |
Journal of publication | CrystEngComm |
Year of publication | 2020 |
Journal volume | 22 |
Journal issue | 5 |
Pages of publication | 878 - 887 |
a | 20.1064 ± 0.0005 Å |
b | 14.018 ± 0.0004 Å |
c | 18.9293 ± 0.0005 Å |
α | 90° |
β | 118.072 ± 0.002° |
γ | 90° |
Cell volume | 4707.6 ± 0.2 Å3 |
Cell temperature | 293 ± 2 K |
Ambient diffraction temperature | 293 ± 2 K |
Number of distinct elements | 4 |
Space group number | 14 |
Hermann-Mauguin space group symbol | P 1 21/c 1 |
Hall space group symbol | -P 2ybc |
Residual factor for all reflections | 0.2691 |
Residual factor for significantly intense reflections | 0.2531 |
Weighted residual factors for significantly intense reflections | 0.5548 |
Weighted residual factors for all reflections included in the refinement | 0.5618 |
Goodness-of-fit parameter for all reflections included in the refinement | 1.111 |
Diffraction radiation wavelength | 0.71073 Å |
Diffraction radiation type | MoKα |