Information card for entry 7240253
Formula | C18 H16 O2 Si |
Calculated formula | C18 H16 O2 Si |
Title of publication | Hydroperoxo double hydrogen bonding: stabilization of hydroperoxo complexes exemplified by triphenylsilicon and triphenylgermanium hydroperoxides |
Authors of publication | Medvedev, Alexander G.; Grishanov, Dmitry A.; Churakov, Andrei V.; Mikhaylov, Alexey A.; Lev, Ovadia; Prikhodchenko, Petr V. |
Journal of publication | CrystEngComm |
Year of publication | 2020 |
Journal volume | 22 |
Journal issue | 11 |
Pages of publication | 1922 - 1928 |
a | 9.8022 ± 0.0003 Å |
b | 11.3939 ± 0.0003 Å |
c | 14.907 ± 0.0004 Å |
α | 88.3116 ± 0.0011° |
β | 89.7934 ± 0.0011° |
γ | 65.7475 ± 0.001° |
Cell volume | 1517.23 ± 0.07 Å3 |
Cell temperature | 150 ± 2 K |
Ambient diffraction temperature | 150 ± 2 K |
Number of distinct elements | 4 |
Space group number | 2 |
Hermann-Mauguin space group symbol | P -1 |
Hall space group symbol | -P 1 |
Residual factor for all reflections | 0.0538 |
Residual factor for significantly intense reflections | 0.0412 |
Weighted residual factors for significantly intense reflections | 0.0913 |
Weighted residual factors for all reflections included in the refinement | 0.0971 |
Goodness-of-fit parameter for all reflections included in the refinement | 1.037 |
Diffraction radiation wavelength | 0.71073 Å |
Diffraction radiation type | MoKα |