Information card for entry 7240254
Formula | C36 H30 Ge2 O2 |
Calculated formula | C36 H30 Ge2 O2 |
Title of publication | Hydroperoxo double hydrogen bonding: stabilization of hydroperoxo complexes exemplified by triphenylsilicon and triphenylgermanium hydroperoxides |
Authors of publication | Medvedev, Alexander G.; Grishanov, Dmitry A.; Churakov, Andrei V.; Mikhaylov, Alexey A.; Lev, Ovadia; Prikhodchenko, Petr V. |
Journal of publication | CrystEngComm |
Year of publication | 2020 |
Journal volume | 22 |
Journal issue | 11 |
Pages of publication | 1922 - 1928 |
a | 8.6748 ± 0.0002 Å |
b | 9.4769 ± 0.0002 Å |
c | 11.2572 ± 0.0003 Å |
α | 65.78 ± 0.001° |
β | 88.888 ± 0.001° |
γ | 66.382 ± 0.001° |
Cell volume | 761.58 ± 0.03 Å3 |
Cell temperature | 150 ± 2 K |
Ambient diffraction temperature | 150 ± 2 K |
Number of distinct elements | 4 |
Space group number | 2 |
Hermann-Mauguin space group symbol | P -1 |
Hall space group symbol | -P 1 |
Residual factor for all reflections | 0.0254 |
Residual factor for significantly intense reflections | 0.0237 |
Weighted residual factors for significantly intense reflections | 0.062 |
Weighted residual factors for all reflections included in the refinement | 0.0628 |
Goodness-of-fit parameter for all reflections included in the refinement | 1.066 |
Diffraction radiation wavelength | 0.71073 Å |
Diffraction radiation type | MoKα |