Information card for entry 7240683
Formula | C15 H20 N4 O3 |
Calculated formula | C15 H20 N4 O3 |
Title of publication | Proline derived guanidine catalysts forge extensive H-bonded architectures: a solution and solid state study |
Authors of publication | Al-Taie, Zahraa S.; Anetts, Simon R.; Christensen, Jeppe; Coles, Simon J.; Horton, Peter N.; Evans, Daniel M.; Jones, Leigh F.; de Kleijne, Frank F. J.; Ledbetter, Shaun M.; Mehdar, Yassin T. H.; Murphy, Patrick J.; Wilson, Jack A. |
Journal of publication | RSC Advances |
Year of publication | 2020 |
Journal volume | 10 |
Journal issue | 38 |
Pages of publication | 22397 - 22416 |
a | 5.5616 ± 0.0003 Å |
b | 17.9003 ± 0.0013 Å |
c | 15.541 ± 0.0009 Å |
α | 90° |
β | 94.111 ± 0.005° |
γ | 90° |
Cell volume | 1543.19 ± 0.17 Å3 |
Cell temperature | 100 ± 2 K |
Ambient diffraction temperature | 100 ± 2 K |
Number of distinct elements | 4 |
Space group number | 4 |
Hermann-Mauguin space group symbol | P 1 21 1 |
Hall space group symbol | P 2yb |
Residual factor for all reflections | 0.1515 |
Residual factor for significantly intense reflections | 0.0684 |
Weighted residual factors for significantly intense reflections | 0.1188 |
Weighted residual factors for all reflections included in the refinement | 0.1447 |
Goodness-of-fit parameter for all reflections included in the refinement | 1.004 |
Diffraction radiation probe | x-ray |
Diffraction radiation wavelength | 0.71073 Å |
Diffraction radiation type | MoKα |
Diffraction radiation X-ray symbol | K-L~3~ |