Information card for entry 7240758
Chemical name | beautiful hen |
Formula | C66 H69 Eu2 N18 O30 S6 |
Calculated formula | C66 H69 Eu2 N18 O30 S6 |
Title of publication | Synthesis, crystal structures, and luminescent properties of Zn(ii), Cd(ii), Eu(iii) complexes and detection of Fe(iii) ions based on a diacylhydrazone Schiff base |
Authors of publication | Han, Aiying; Su, Hao; Xu, Guohong; Khan, Maroof Ahmad; Li, Hui |
Journal of publication | RSC Advances |
Year of publication | 2020 |
Journal volume | 10 |
Journal issue | 39 |
Pages of publication | 23372 - 23378 |
a | 27.308 ± 0.006 Å |
b | 19.968 ± 0.005 Å |
c | 16.327 ± 0.003 Å |
α | 90° |
β | 90° |
γ | 90° |
Cell volume | 8903 ± 3 Å3 |
Cell temperature | 296 ± 2 K |
Ambient diffraction temperature | 296.15 K |
Number of distinct elements | 6 |
Space group number | 60 |
Hermann-Mauguin space group symbol | P b c n |
Hall space group symbol | -P 2n 2ab |
Residual factor for all reflections | 0.1437 |
Residual factor for significantly intense reflections | 0.0728 |
Weighted residual factors for significantly intense reflections | 0.1676 |
Weighted residual factors for all reflections included in the refinement | 0.2027 |
Goodness-of-fit parameter for all reflections included in the refinement | 1.031 |
Diffraction radiation wavelength | 0.71073 Å |
Diffraction radiation type | MoKα |