Information card for entry 7240759
Formula | C40 H84 Si5 |
Calculated formula | C40 H84 Si5 |
Title of publication | Application of multifunctional silylenes and siliranes as universal crosslinkers for metal-free curing of silicones |
Authors of publication | Herz, Fabian A. D.; Nobis, Matthias; Wendel, Daniel; Pahl, Philipp; Altmann, Philipp J.; Tillmann, Jan; Weidner, Richard; Inoue, Shigeyoshi; Rieger, Bernhard |
Journal of publication | Green Chemistry |
Year of publication | 2020 |
Journal volume | 22 |
Journal issue | 14 |
Pages of publication | 4489 - 4497 |
a | 16.882 ± 0.002 Å |
b | 16.882 ± 0.002 Å |
c | 16.323 ± 0.002 Å |
α | 90° |
β | 90° |
γ | 90° |
Cell volume | 4652.1 ± 1 Å3 |
Cell temperature | 100 K |
Ambient diffraction temperature | 100 K |
Number of distinct elements | 3 |
Space group number | 88 |
Hermann-Mauguin space group symbol | I 41/a :2 |
Hall space group symbol | -I 4ad |
Residual factor for all reflections | 0.0496 |
Residual factor for significantly intense reflections | 0.0431 |
Weighted residual factors for significantly intense reflections | 0.1071 |
Weighted residual factors for all reflections included in the refinement | 0.1125 |
Goodness-of-fit parameter for all reflections included in the refinement | 1.035 |
Diffraction radiation probe | x-ray |
Diffraction radiation wavelength | 0.71073 Å |
Diffraction radiation type | MoKα |