Information card for entry 7241792
Formula | C40 H20 N5 O18 Sc3 |
Calculated formula | C40 H19 N5 O18 Sc3 |
Title of publication | Isoreticular chemistry of scandium analogues of the multicomponent metal‒organic framework MIL-142 |
Authors of publication | Prasad, Ram R. R.; Pleass, Charlotte; Rigg, Amber L.; Cordes, David B.; Lozinska, Magdalena M.; Georgieva, Veselina M.; Hoffmann, Frank; Slawin, Alexandra M. Z.; Wright, Paul A. |
Journal of publication | CrystEngComm |
Year of publication | 2021 |
Journal volume | 23 |
Journal issue | 4 |
Pages of publication | 804 - 812 |
a | 28.817 ± 0.0007 Å |
b | 28.817 ± 0.0007 Å |
c | 47.9423 ± 0.0007 Å |
α | 90° |
β | 90° |
γ | 120° |
Cell volume | 34478.4 ± 1.3 Å3 |
Cell temperature | 125 K |
Ambient diffraction temperature | 125 K |
Number of distinct elements | 5 |
Space group number | 166 |
Hermann-Mauguin space group symbol | R -3 m :H |
Hall space group symbol | -R 3 2" |
Residual factor for all reflections | 0.1046 |
Residual factor for significantly intense reflections | 0.0653 |
Weighted residual factors for significantly intense reflections | 0.184 |
Weighted residual factors for all reflections included in the refinement | 0.2103 |
Goodness-of-fit parameter for all reflections included in the refinement | 1.008 |
Diffraction radiation wavelength | 1.54187 Å |
Diffraction radiation type | CuKα |