Information card for entry 7241793
Formula | C40 H22 N5 O16 Sc3 |
Calculated formula | C40 H21 N5 O16 Sc3 |
Title of publication | Isoreticular chemistry of scandium analogues of the multicomponent metal‒organic framework MIL-142 |
Authors of publication | Prasad, Ram R. R.; Pleass, Charlotte; Rigg, Amber L.; Cordes, David B.; Lozinska, Magdalena M.; Georgieva, Veselina M.; Hoffmann, Frank; Slawin, Alexandra M. Z.; Wright, Paul A. |
Journal of publication | CrystEngComm |
Year of publication | 2021 |
Journal volume | 23 |
Journal issue | 4 |
Pages of publication | 804 - 812 |
a | 28.8727 ± 0.0019 Å |
b | 28.8727 ± 0.0019 Å |
c | 47.845 ± 0.003 Å |
α | 90° |
β | 90° |
γ | 120° |
Cell volume | 34542 ± 4 Å3 |
Cell temperature | 173 K |
Ambient diffraction temperature | 173 K |
Number of distinct elements | 5 |
Space group number | 166 |
Hermann-Mauguin space group symbol | R -3 m :H |
Hall space group symbol | -R 3 2" |
Residual factor for all reflections | 0.0665 |
Residual factor for significantly intense reflections | 0.0566 |
Weighted residual factors for significantly intense reflections | 0.1736 |
Weighted residual factors for all reflections included in the refinement | 0.1842 |
Goodness-of-fit parameter for all reflections included in the refinement | 1.076 |
Diffraction radiation wavelength | 1.54187 Å |
Diffraction radiation type | CuKα |