Information card for entry 7241911
Common name | 4-Chloropiperidine_trihydrate |
Formula | C5 H16 Cl N O3 |
Calculated formula | C5 H16 Cl N O3 |
SMILES | ClC1CCNCC1.O.O.O |
Title of publication | Intermolecular interactions in hydrates of 4-methylpiperidine and 4-chloropiperidine ‒ a structural and computational study |
Authors of publication | Socha, Paweł; Prus, Bernadeta; Dobrzycki, Łukasz; Boese, Roland; Cyrański, Michał K. |
Journal of publication | CrystEngComm |
Year of publication | 2021 |
Journal volume | 23 |
Journal issue | 5 |
Pages of publication | 1251 - 1262 |
a | 12.5492 ± 0.0019 Å |
b | 6.2375 ± 0.0007 Å |
c | 12.3157 ± 0.0018 Å |
α | 90° |
β | 94.551 ± 0.005° |
γ | 90° |
Cell volume | 961 ± 0.2 Å3 |
Cell temperature | 210 ± 2 K |
Ambient diffraction temperature | 210 ± 2 K |
Number of distinct elements | 5 |
Space group number | 14 |
Hermann-Mauguin space group symbol | P 1 21/c 1 |
Hall space group symbol | -P 2ybc |
Residual factor for all reflections | 0.1132 |
Residual factor for significantly intense reflections | 0.0554 |
Weighted residual factors for significantly intense reflections | 0.1062 |
Weighted residual factors for all reflections included in the refinement | 0.1281 |
Goodness-of-fit parameter for all reflections included in the refinement | 1.065 |
Diffraction radiation wavelength | 0.71073 Å |
Diffraction radiation type | MoKα |