Information card for entry 7241912
Common name | 4-Methylpiperidine_hemihydrate |
Formula | C6 H14 N O0.5 |
Calculated formula | C6 H14 N O0.5 |
SMILES | O.N1CCC(CC1)C |
Title of publication | Intermolecular interactions in hydrates of 4-methylpiperidine and 4-chloropiperidine – a structural and computational study |
Authors of publication | Socha, Paweł; Prus, Bernadeta; Dobrzycki, Łukasz; Boese, Roland; Cyrański, Michał K. |
Journal of publication | CrystEngComm |
Year of publication | 2021 |
Journal volume | 23 |
Journal issue | 5 |
Pages of publication | 1251 - 1262 |
a | 5.3447 ± 0.0004 Å |
b | 23.72 ± 0.002 Å |
c | 11.2047 ± 0.0009 Å |
α | 90° |
β | 99.241 ± 0.002° |
γ | 90° |
Cell volume | 1402.05 ± 0.19 Å3 |
Cell temperature | 175 ± 2 K |
Ambient diffraction temperature | 175 ± 2 K |
Number of distinct elements | 4 |
Space group number | 14 |
Hermann-Mauguin space group symbol | P 1 21/c 1 |
Hall space group symbol | -P 2ybc |
Residual factor for all reflections | 0.0646 |
Residual factor for significantly intense reflections | 0.0532 |
Weighted residual factors for significantly intense reflections | 0.1318 |
Weighted residual factors for all reflections included in the refinement | 0.1402 |
Goodness-of-fit parameter for all reflections included in the refinement | 1.069 |
Diffraction radiation wavelength | 0.71073 Å |
Diffraction radiation type | MoKα |