Information card for entry 7241913
Common name | 4-Methylpiperidine_trihydrate |
Formula | C6 H19 N O3 |
Calculated formula | C6 H19 N O3 |
SMILES | N1CCC(CC1)C.O.O.O |
Title of publication | Intermolecular interactions in hydrates of 4-methylpiperidine and 4-chloropiperidine ‒ a structural and computational study |
Authors of publication | Socha, Paweł; Prus, Bernadeta; Dobrzycki, Łukasz; Boese, Roland; Cyrański, Michał K. |
Journal of publication | CrystEngComm |
Year of publication | 2021 |
Journal volume | 23 |
Journal issue | 5 |
Pages of publication | 1251 - 1262 |
a | 13.176 ± 0.003 Å |
b | 6.3382 ± 0.0011 Å |
c | 11.846 ± 0.002 Å |
α | 90° |
β | 103.596 ± 0.007° |
γ | 90° |
Cell volume | 961.6 ± 0.3 Å3 |
Cell temperature | 100 ± 2 K |
Ambient diffraction temperature | 100 ± 2 K |
Number of distinct elements | 4 |
Space group number | 14 |
Hermann-Mauguin space group symbol | P 1 21/c 1 |
Hall space group symbol | -P 2ybc |
Residual factor for all reflections | 0.0422 |
Residual factor for significantly intense reflections | 0.0375 |
Weighted residual factors for significantly intense reflections | 0.1034 |
Weighted residual factors for all reflections included in the refinement | 0.1083 |
Goodness-of-fit parameter for all reflections included in the refinement | 1.137 |
Diffraction radiation wavelength | 0.71073 Å |
Diffraction radiation type | MoKα |