Information card for entry 7241944
Chemical name | [Co(hfacac)4(BisPyBz)2] |
Formula | C14 H9 Co0.5 F6 N O2 |
Calculated formula | C14 H9 Co0.5 F6 N O2 |
Title of publication | Single molecule magnets of cobalt and zinc homo- and heterometallic coordination polymers prepared by a one-step synthetic procedure |
Authors of publication | Portolés-Gil, Núria; Gómez-Coca, Silvia; Vallcorba, Oriol; Marbán, Gregorio; Aliaga-Alcalde, Núria; López-Periago, Ana; Ayllón, José A.; Domingo, Concepción |
Journal of publication | RSC Advances |
Year of publication | 2020 |
Journal volume | 10 |
Journal issue | 73 |
Pages of publication | 45090 - 45104 |
a | 8.7704 ± 0.00007 Å |
b | 9.1599 ± 0.00006 Å |
c | 10.043 ± 0.00011 Å |
α | 62.972 ± 0.0006° |
β | 71.41 ± 0.0007° |
γ | 80.889 ± 0.0006° |
Cell volume | 681.112 ± 0.011 Å3 |
Cell temperature | 100 ± 2 K |
Ambient diffraction temperature | 100 ± 2 K |
Number of distinct elements | 6 |
Space group number | 2 |
Hermann-Mauguin space group symbol | P -1 |
Hall space group symbol | -P 1 |
Residual factor for all reflections | 0.0289 |
Residual factor for significantly intense reflections | 0.0288 |
Weighted residual factors for significantly intense reflections | 0.079 |
Weighted residual factors for all reflections included in the refinement | 0.0794 |
Goodness-of-fit parameter for all reflections included in the refinement | 1.096 |
Diffraction radiation wavelength | 0.72931 Å |
Diffraction radiation type | synchrotron |