Information card for entry 7241945
Formula | C160 H117.4 Cd10 N25 O49.2 |
Calculated formula | C160 H117.4 Cd10 N25 O49.2 |
Title of publication | An exceptionally stable luminescent cadmium(ii) metal‒organic framework as a dual-functional chemosensor for detecting Cr(vi) anions and nitro-containing antibiotics in aqueous media |
Authors of publication | Fan, Liming; Zhao, Dongsheng; Li, Bei; Chen, Xi; Wang, Feng; Deng, Yuxin; Niu, Yulan; Zhang, Xiutang |
Journal of publication | CrystEngComm |
Year of publication | 2021 |
Journal volume | 23 |
Journal issue | 5 |
Pages of publication | 1218 - 1225 |
a | 13.98878 ± 0.00006 Å |
b | 23.20468 ± 0.00008 Å |
c | 26.86614 ± 0.00009 Å |
α | 103.05 ± 0.0003° |
β | 91.7765 ± 0.0003° |
γ | 93.9686 ± 0.0003° |
Cell volume | 8465.51 ± 0.06 Å3 |
Cell temperature | 297 K |
Ambient diffraction temperature | 297 K |
Number of distinct elements | 5 |
Space group number | 2 |
Hermann-Mauguin space group symbol | P -1 |
Hall space group symbol | -P 1 |
Residual factor for all reflections | 0.0518 |
Residual factor for significantly intense reflections | 0.0498 |
Weighted residual factors for significantly intense reflections | 0.1347 |
Weighted residual factors for all reflections included in the refinement | 0.1365 |
Goodness-of-fit parameter for all reflections included in the refinement | 1.053 |
Diffraction radiation probe | x-ray |
Diffraction radiation wavelength | 1.54184 Å |
Diffraction radiation type | CuKα |