Information card for entry 7241952
Formula | C12 H8 Cl5 N O |
Calculated formula | C12 H8 Cl5 N O |
SMILES | Clc1c(O)c(Cl)c(Cl)c(Cl)c1Cl.n1ccc(cc1)C |
Title of publication | Suppression of isotopic polymorphism |
Authors of publication | Funnell, Nicholas P.; Allan, David R.; Maloney, Andrew G. P.; Smith, Ronald I.; Wilson, Cameron J. G.; Parsons, Simon |
Journal of publication | CrystEngComm |
Year of publication | 2021 |
Journal volume | 23 |
Journal issue | 4 |
Pages of publication | 769 - 776 |
a | 7.1745 ± 0.00003 Å |
b | 8.4378 ± 0.00007 Å |
c | 12.7346 ± 0.00007 Å |
α | 100.591 ± 0.012° |
β | 115.749 ± 0.007° |
γ | 104.468 ± 0.008° |
Cell volume | 633.45 ± 0.09 Å3 |
Cell temperature | 293 K |
Ambient diffraction temperature | 293 K |
Cell measurement pressure | 1.47 kPa |
Number of distinct elements | 5 |
Space group number | 2 |
Hermann-Mauguin space group symbol | P -1 |
Hall space group symbol | -P 1 |
Residual factor for all reflections | 0.1194 |
Residual factor for significantly intense reflections | 0.1015 |
Weighted residual factors for all reflections | 0.2606 |
Weighted residual factors for significantly intense reflections | 0.2456 |
Weighted residual factors for all reflections included in the refinement | 0.2606 |
Goodness-of-fit parameter for all reflections included in the refinement | 1.008 |
Diffraction radiation wavelength | 0.6889 Å |
Diffraction radiation type | synchrotron |