Information card for entry 7241953
Chemical name | 4-methylpyridine pentachlorophenol |
Formula | C12 H8 Cl5 N O |
Calculated formula | C12 H8 Cl5 N O |
SMILES | Clc1c(O)c(Cl)c(Cl)c(Cl)c1Cl.n1ccc(cc1)C |
Title of publication | Suppression of isotopic polymorphism |
Authors of publication | Funnell, Nicholas P.; Allan, David R.; Maloney, Andrew G. P.; Smith, Ronald I.; Wilson, Cameron J. G.; Parsons, Simon |
Journal of publication | CrystEngComm |
Year of publication | 2021 |
Journal volume | 23 |
Journal issue | 4 |
Pages of publication | 769 - 776 |
a | 7.394 ± 0.00003 Å |
b | 8.9363 ± 0.00007 Å |
c | 13.688 ± 0.00006 Å |
α | 100.541 ± 0.011° |
β | 118.408 ± 0.007° |
γ | 103.46 ± 0.008° |
Cell volume | 726.65 ± 0.1 Å3 |
Cell temperature | 293 K |
Ambient diffraction temperature | 293 K |
Cell measurement pressure | 0 kPa |
Number of distinct elements | 5 |
Space group number | 2 |
Hermann-Mauguin space group symbol | P -1 |
Hall space group symbol | -P 1 |
Residual factor for all reflections | 0.2496 |
Residual factor for significantly intense reflections | 0.2366 |
Weighted residual factors for all reflections | 0.5572 |
Weighted residual factors for significantly intense reflections | 0.5524 |
Weighted residual factors for all reflections included in the refinement | 0.5572 |
Goodness-of-fit parameter for all reflections included in the refinement | 1.6344 |
Diffraction radiation wavelength | 0.6889 Å |
Diffraction radiation type | synchrotron |