Information card for entry 7241963
Common name |
(Protonated proton sponge) triiodoplumbate, beta phase |
Chemical name |
(Protonated proton sponge) triiodoplumbate, beta phase |
Formula |
C14 H19 I3 N2 Pb |
Calculated formula |
C14 H19 I3 N2 Pb |
Title of publication |
Proton sponge lead halides containing 1D polyoctahedral chains |
Authors of publication |
Pipitone, Candida; Giannici, Francesco; Martorana, Antonino; Bertolotti, Federica; Calabrese, Gabriele; Milita, Silvia; Guagliardi, Antonietta; Masciocchi, Norberto |
Journal of publication |
CrystEngComm |
Year of publication |
2021 |
Journal volume |
23 |
Journal issue |
5 |
Pages of publication |
1126 - 1139 |
a |
25.053 ± 0.0012 Å |
b |
10.4016 ± 0.0005 Å |
c |
8.0082 ± 0.0003 Å |
α |
90° |
β |
90° |
γ |
90° |
Cell volume |
2086.87 ± 0.16 Å3 |
Cell temperature |
293 ± 2 K |
Ambient diffraction temperature |
298 K |
Number of distinct elements |
5 |
Space group number |
29 |
Hermann-Mauguin space group symbol |
P c a 21 |
Hall space group symbol |
P 2c -2ac |
Goodness-of-fit parameter for all reflections |
12 |
Method of determination |
powder diffraction |
Diffraction radiation wavelength |
1.5418 Å |
Diffraction radiation type |
CuKα |
Yes |
No |
No |