Information card for entry 7241964
Common name |
(Protonated proton sponge) tribromoplumbate |
Chemical name |
(Protonated proton sponge) triiodoplumbate, alpha phase |
Formula |
C14 H19 Br3 N2 Pb |
Calculated formula |
C14 H19 Br3 N2 Pb |
Title of publication |
Proton sponge lead halides containing 1D polyoctahedral chains |
Authors of publication |
Pipitone, Candida; Giannici, Francesco; Martorana, Antonino; Bertolotti, Federica; Calabrese, Gabriele; Milita, Silvia; Guagliardi, Antonietta; Masciocchi, Norberto |
Journal of publication |
CrystEngComm |
Year of publication |
2021 |
Journal volume |
23 |
Journal issue |
5 |
Pages of publication |
1126 - 1139 |
a |
28.0408 ± 0.0006 Å |
b |
17.385 ± 0.0003 Å |
c |
7.88582 ± 0.00016 Å |
α |
90° |
β |
90° |
γ |
90° |
Cell volume |
3844.25 ± 0.13 Å3 |
Cell temperature |
293 ± 2 K |
Ambient diffraction temperature |
298 K |
Number of distinct elements |
5 |
Space group number |
61 |
Hermann-Mauguin space group symbol |
P b c a |
Hall space group symbol |
-P 2ac 2ab |
Goodness-of-fit parameter for all reflections |
14.2 |
Method of determination |
powder diffraction |
Diffraction radiation wavelength |
1.5418 Å |
Diffraction radiation type |
CuKα |
Yes |
No |
No |