Information card for entry 7241975
Formula | C20 H28 N6 O6 S5 |
Calculated formula | C8 H16 N6 O6 S2 |
Title of publication | Dynamic structural reconstruction of (guanidinium+)2(benzene-1,4-disulfonate2−) host crystal by guest adsorption |
Authors of publication | Abe, Haruka; Kobayashi, Takahiro; Hoshino, Norihisa; Takeda, Takashi; Suzuki, Yasutaka; Kawamata, Jun; Akutagawa, Tomoyuki |
Journal of publication | CrystEngComm |
Year of publication | 2021 |
Journal volume | 23 |
Journal issue | 5 |
Pages of publication | 1149 - 1157 |
a | 7.623 ± 0.0003 Å |
b | 16.8745 ± 0.0008 Å |
c | 11.809 ± 0.0006 Å |
α | 90° |
β | 90.488 ± 0.006° |
γ | 90° |
Cell volume | 1518.99 ± 0.12 Å3 |
Cell temperature | 100 ± 2 K |
Ambient diffraction temperature | 100 ± 2 K |
Number of distinct elements | 5 |
Space group number | 14 |
Hermann-Mauguin space group symbol | P 1 21/n 1 |
Hall space group symbol | -P 2yn |
Residual factor for all reflections | 0.1118 |
Residual factor for significantly intense reflections | 0.095 |
Weighted residual factors for significantly intense reflections | 0.2899 |
Weighted residual factors for all reflections included in the refinement | 0.3084 |
Goodness-of-fit parameter for all reflections included in the refinement | 1.083 |
Diffraction radiation wavelength | 1.54187 Å |
Diffraction radiation type | CuKα |