Information card for entry 7241976
Formula | C9 H10 Br0.25 Cl0.75 N O2 |
Calculated formula | C9 H10 Br0.25 Cl0.75 N O2 |
Title of publication | The impact of solid solution composition on kinetics and mechanism of [2 + 2] photodimerization of cinnamic acid derivatives |
Authors of publication | Pandolfi, Lorenzo; Giunchi, Andrea; Salzillo, Tommaso; Brillante, Aldo; Della Valle, Raffaele G.; Venuti, Elisabetta; Grepioni, Fabrizia; D'Agostino, Simone |
Journal of publication | CrystEngComm |
Year of publication | 2021 |
Journal volume | 23 |
Journal issue | 6 |
Pages of publication | 1352 - 1359 |
a | 5.6333 ± 0.0002 Å |
b | 8.584 ± 0.0004 Å |
c | 19.6694 ± 0.0009 Å |
α | 90° |
β | 92.189 ± 0.004° |
γ | 90° |
Cell volume | 950.44 ± 0.07 Å3 |
Cell temperature | 300 K |
Ambient diffraction temperature | 300 K |
Number of distinct elements | 6 |
Space group number | 14 |
Hermann-Mauguin space group symbol | P 1 21/c 1 |
Hall space group symbol | -P 2ybc |
Residual factor for all reflections | 0.0783 |
Residual factor for significantly intense reflections | 0.0524 |
Weighted residual factors for significantly intense reflections | 0.1245 |
Weighted residual factors for all reflections included in the refinement | 0.1396 |
Goodness-of-fit parameter for all reflections included in the refinement | 1.068 |
Diffraction radiation wavelength | 0.71073 Å |
Diffraction radiation type | MoKα |