Information card for entry 7241991
Formula | C45 H39 Eu2 N3 O15 |
Calculated formula | C45 H39 Eu2 N3 O15 |
Title of publication | Structural diversity of four lanthanide metal‒organic frameworks based on 2,6-naphthalenedicarboxylate: synthesis, structures and photoluminescent properties |
Authors of publication | Chatenever, Ana R. K.; Ehlke, Beatriz; Le Maguerès, Pierre; Reinheimer, Eric W.; Song, Xueling; Fei, Honghan; Oliver, Scott R. J. |
Journal of publication | CrystEngComm |
Year of publication | 2021 |
Journal volume | 23 |
Journal issue | 6 |
Pages of publication | 1388 - 1397 |
a | 11.9185 ± 0.0003 Å |
b | 21.873 ± 0.0005 Å |
c | 16.5342 ± 0.0004 Å |
α | 90° |
β | 100.476 ± 0.002° |
γ | 90° |
Cell volume | 4238.51 ± 0.18 Å3 |
Cell temperature | 100.01 ± 0.1 K |
Ambient diffraction temperature | 100.01 ± 0.1 K |
Number of distinct elements | 5 |
Space group number | 14 |
Hermann-Mauguin space group symbol | P 1 21/n 1 |
Hall space group symbol | -P 2yn |
Residual factor for all reflections | 0.0353 |
Residual factor for significantly intense reflections | 0.022 |
Weighted residual factors for significantly intense reflections | 0.0462 |
Weighted residual factors for all reflections included in the refinement | 0.0499 |
Goodness-of-fit parameter for all reflections included in the refinement | 1.025 |
Diffraction radiation probe | x-ray |
Diffraction radiation wavelength | 0.71073 Å |
Diffraction radiation type | MoKα |