Information card for entry 7241992
Formula | C135 H121 La6 N9 O47 |
Calculated formula | C135 H121 La6 N9 O47 |
Title of publication | Structural diversity of four lanthanide metal‒organic frameworks based on 2,6-naphthalenedicarboxylate: synthesis, structures and photoluminescent properties |
Authors of publication | Chatenever, Ana R. K.; Ehlke, Beatriz; Le Maguerès, Pierre; Reinheimer, Eric W.; Song, Xueling; Fei, Honghan; Oliver, Scott R. J. |
Journal of publication | CrystEngComm |
Year of publication | 2021 |
Journal volume | 23 |
Journal issue | 6 |
Pages of publication | 1388 - 1397 |
a | 13.2526 ± 0.0008 Å |
b | 14.3785 ± 0.0008 Å |
c | 19.9214 ± 0.001 Å |
α | 70.927 ± 0.005° |
β | 74.63 ± 0.005° |
γ | 75.542 ± 0.005° |
Cell volume | 3403.5 ± 0.4 Å3 |
Cell temperature | 100 ± 2 K |
Ambient diffraction temperature | 100 ± 2 K |
Number of distinct elements | 5 |
Space group number | 2 |
Hermann-Mauguin space group symbol | P -1 |
Hall space group symbol | -P 1 |
Residual factor for all reflections | 0.0624 |
Residual factor for significantly intense reflections | 0.043 |
Weighted residual factors for significantly intense reflections | 0.103 |
Weighted residual factors for all reflections included in the refinement | 0.1171 |
Goodness-of-fit parameter for all reflections included in the refinement | 1.047 |
Diffraction radiation probe | x-ray |
Diffraction radiation wavelength | 1.54184 Å |
Diffraction radiation type | CuKα |