Information card for entry 7242195
Formula | C84 H198 Mn6 N28 Na2 O276 P10 W60 |
Calculated formula | C84 H82 Mn6 N28 Na2 O276 P10 W60 |
Title of publication | Preyssler-type polyoxometalate-based crystalline materials for the electrochemical detection of H2O2 |
Authors of publication | Zhu, HaoTian; Tang, WenSi; Ma, YuanYuan; Wang, YongHui; Tan, HuaQiao; Li, YangGuang |
Journal of publication | CrystEngComm |
Year of publication | 2021 |
Journal volume | 23 |
Journal issue | 10 |
Pages of publication | 2071 - 2080 |
a | 17.672 ± 0.002 Å |
b | 18.819 ± 0.003 Å |
c | 26.029 ± 0.004 Å |
α | 80.998 ± 0.002° |
β | 72.959 ± 0.002° |
γ | 65.534 ± 0.002° |
Cell volume | 7527.1 ± 1.9 Å3 |
Cell temperature | 296 ± 2 K |
Ambient diffraction temperature | 296 ± 2 K |
Number of distinct elements | 8 |
Space group number | 2 |
Hermann-Mauguin space group symbol | P -1 |
Hall space group symbol | -P 1 |
Residual factor for all reflections | 0.0749 |
Residual factor for significantly intense reflections | 0.0459 |
Weighted residual factors for significantly intense reflections | 0.0918 |
Weighted residual factors for all reflections included in the refinement | 0.1051 |
Goodness-of-fit parameter for all reflections included in the refinement | 1.006 |
Diffraction radiation wavelength | 0.71073 Å |
Diffraction radiation type | MoKα |