Information card for entry 7242196
Formula | C60 H104 Cl0 Cu5 N20 Na O134 P5 W30 |
Calculated formula | C60 H52 Cu5 N20 Na O134 P5 W30 |
Title of publication | Preyssler-type polyoxometalate-based crystalline materials for the electrochemical detection of H2O2 |
Authors of publication | Zhu, HaoTian; Tang, WenSi; Ma, YuanYuan; Wang, YongHui; Tan, HuaQiao; Li, YangGuang |
Journal of publication | CrystEngComm |
Year of publication | 2021 |
Journal volume | 23 |
Journal issue | 10 |
Pages of publication | 2071 - 2080 |
a | 21.182 ± 0.004 Å |
b | 16.487 ± 0.003 Å |
c | 28.78 ± 0.004 Å |
α | 90° |
β | 130.213 ± 0.009° |
γ | 90° |
Cell volume | 7675 ± 2 Å3 |
Cell temperature | 296 ± 2 K |
Ambient diffraction temperature | 296 ± 2 K |
Number of distinct elements | 9 |
Space group number | 7 |
Hermann-Mauguin space group symbol | P 1 c 1 |
Hall space group symbol | P -2yc |
Residual factor for all reflections | 0.0654 |
Residual factor for significantly intense reflections | 0.0552 |
Weighted residual factors for significantly intense reflections | 0.1295 |
Weighted residual factors for all reflections included in the refinement | 0.1353 |
Goodness-of-fit parameter for all reflections included in the refinement | 1.013 |
Diffraction radiation wavelength | 0.71073 Å |
Diffraction radiation type | MoKα |