Information card for entry 7242198
Formula | C48 H88 Co2 N16 Na O129 P5 W30 |
Calculated formula | C48 H46 Co2 N16 Na O129 P5 W30 |
Title of publication | Preyssler-type polyoxometalate-based crystalline materials for the electrochemical detection of H2O2 |
Authors of publication | Zhu, HaoTian; Tang, WenSi; Ma, YuanYuan; Wang, YongHui; Tan, HuaQiao; Li, YangGuang |
Journal of publication | CrystEngComm |
Year of publication | 2021 |
Journal volume | 23 |
Journal issue | 10 |
Pages of publication | 2071 - 2080 |
a | 16.234 ± 0.006 Å |
b | 16.833 ± 0.006 Å |
c | 17.107 ± 0.007 Å |
α | 67.181 ± 0.006° |
β | 64.121 ± 0.006° |
γ | 82.689 ± 0.007° |
Cell volume | 3872 ± 3 Å3 |
Cell temperature | 296 ± 2 K |
Ambient diffraction temperature | 296 ± 2 K |
Number of distinct elements | 8 |
Space group number | 2 |
Hermann-Mauguin space group symbol | P -1 |
Hall space group symbol | -P 1 |
Residual factor for all reflections | 0.0725 |
Residual factor for significantly intense reflections | 0.0447 |
Weighted residual factors for significantly intense reflections | 0.1 |
Weighted residual factors for all reflections included in the refinement | 0.1146 |
Goodness-of-fit parameter for all reflections included in the refinement | 1.013 |
Diffraction radiation wavelength | 0.71073 Å |
Diffraction radiation type | MoKα |