Information card for entry 7242197
Formula | C60 H96 N20 Na O129 P5 W30 Zn3 |
Calculated formula | C60 H56 N20 Na O129 P5 W30 Zn3 |
Title of publication | Preyssler-type polyoxometalate-based crystalline materials for the electrochemical detection of H2O2 |
Authors of publication | Zhu, HaoTian; Tang, WenSi; Ma, YuanYuan; Wang, YongHui; Tan, HuaQiao; Li, YangGuang |
Journal of publication | CrystEngComm |
Year of publication | 2021 |
Journal volume | 23 |
Journal issue | 10 |
Pages of publication | 2071 - 2080 |
a | 29.418 ± 0.005 Å |
b | 21.615 ± 0.004 Å |
c | 25.107 ± 0.004 Å |
α | 90° |
β | 99.316 ± 0.003° |
γ | 90° |
Cell volume | 15754 ± 5 Å3 |
Cell temperature | 296 ± 2 K |
Ambient diffraction temperature | 296 ± 2 K |
Number of distinct elements | 8 |
Space group number | 15 |
Hermann-Mauguin space group symbol | C 1 2/c 1 |
Hall space group symbol | -C 2yc |
Residual factor for all reflections | 0.0903 |
Residual factor for significantly intense reflections | 0.054 |
Weighted residual factors for significantly intense reflections | 0.1081 |
Weighted residual factors for all reflections included in the refinement | 0.1217 |
Goodness-of-fit parameter for all reflections included in the refinement | 1.042 |
Diffraction radiation wavelength | 0.71073 Å |
Diffraction radiation type | MoKα |