Information card for entry 7242243
Formula | C8 H6 Ag F N4 O3 |
Calculated formula | C8 H6 Ag F N4 O3 |
Title of publication | Silver(i) coordination polymers based on halogenated cyanoformamidine: roles of oxyanions and halogen atoms in the structural diversity |
Authors of publication | Cheng, Fu-Hung; Liu, Yu-Hsiang; Lee, Wei-Te; Hu, Ji-Hong; Hu, Hui-Ling; Mahat Chhetri, Pradhumna; Chen, Jhy-Der |
Journal of publication | CrystEngComm |
Year of publication | 2021 |
Journal volume | 23 |
Journal issue | 9 |
Pages of publication | 1961 - 1968 |
a | 3.7261 ± 0.0002 Å |
b | 7.1007 ± 0.0004 Å |
c | 19.4928 ± 0.0011 Å |
α | 97.342 ± 0.003° |
β | 94.485 ± 0.003° |
γ | 98.505 ± 0.003° |
Cell volume | 503.4 ± 0.05 Å3 |
Cell temperature | 296 ± 2 K |
Ambient diffraction temperature | 296 ± 2 K |
Number of distinct elements | 6 |
Space group number | 2 |
Hermann-Mauguin space group symbol | P -1 |
Hall space group symbol | -P 1 |
Residual factor for all reflections | 0.0487 |
Residual factor for significantly intense reflections | 0.0383 |
Weighted residual factors for significantly intense reflections | 0.0979 |
Weighted residual factors for all reflections included in the refinement | 0.1038 |
Goodness-of-fit parameter for all reflections included in the refinement | 1.071 |
Diffraction radiation wavelength | 0.71073 Å |
Diffraction radiation type | MoKα |