Information card for entry 7242244
Formula | C16 H12 Ag Cl I2 N6 O4 |
Calculated formula | C16 H12 Ag Cl I2 N6 O4 |
Title of publication | Silver(i) coordination polymers based on halogenated cyanoformamidine: roles of oxyanions and halogen atoms in the structural diversity |
Authors of publication | Cheng, Fu-Hung; Liu, Yu-Hsiang; Lee, Wei-Te; Hu, Ji-Hong; Hu, Hui-Ling; Mahat Chhetri, Pradhumna; Chen, Jhy-Der |
Journal of publication | CrystEngComm |
Year of publication | 2021 |
Journal volume | 23 |
Journal issue | 9 |
Pages of publication | 1961 - 1968 |
a | 8.0342 ± 0.0006 Å |
b | 21.6112 ± 0.0015 Å |
c | 12.453 ± 0.0009 Å |
α | 90° |
β | 90.03° |
γ | 90° |
Cell volume | 2162.2 ± 0.3 Å3 |
Cell temperature | 296 ± 2 K |
Ambient diffraction temperature | 296 ± 2 K |
Number of distinct elements | 7 |
Space group number | 14 |
Hermann-Mauguin space group symbol | P 1 21/n 1 |
Hall space group symbol | -P 2yn |
Residual factor for all reflections | 0.0624 |
Residual factor for significantly intense reflections | 0.0393 |
Weighted residual factors for significantly intense reflections | 0.0783 |
Weighted residual factors for all reflections included in the refinement | 0.0821 |
Goodness-of-fit parameter for all reflections included in the refinement | 1.007 |
Diffraction radiation wavelength | 0.71073 Å |
Diffraction radiation type | MoKα |