Information card for entry 7242262
Formula | C37 H27.5 N4.5 O10.5 Zn2 |
Calculated formula | C37 H26.5 N4.5 O10.5 Zn2 |
Title of publication | The influence of linker substitution on the fluorescence responsive sensing of isostructural coordination polymers: visual turn-on, ratiometric, and turn-off sensing in water |
Authors of publication | Chuang, Po-Min; Huang, Yun-Wen; Liu, Yu-Lin; Wu, Jing-Yun |
Journal of publication | CrystEngComm |
Year of publication | 2021 |
Journal volume | 23 |
Journal issue | 11 |
Pages of publication | 2222 - 2234 |
a | 24.717 ± 0.003 Å |
b | 19.189 ± 0.003 Å |
c | 15.197 ± 0.002 Å |
α | 90° |
β | 105.906 ± 0.006° |
γ | 90° |
Cell volume | 6931.9 ± 1.7 Å3 |
Cell temperature | 150 ± 2 K |
Ambient diffraction temperature | 150 ± 2 K |
Number of distinct elements | 5 |
Space group number | 15 |
Hermann-Mauguin space group symbol | C 1 2/c 1 |
Hall space group symbol | -C 2yc |
Residual factor for all reflections | 0.1351 |
Residual factor for significantly intense reflections | 0.0826 |
Weighted residual factors for significantly intense reflections | 0.185 |
Weighted residual factors for all reflections included in the refinement | 0.2313 |
Goodness-of-fit parameter for all reflections included in the refinement | 1.133 |
Diffraction radiation wavelength | 0.71073 Å |
Diffraction radiation type | MoKα |