Information card for entry 7242263
Formula | C34 H22.5 Br1.5 N3 O8 Zn2 |
Calculated formula | C34 H20.5 Br1.5 N3 O8 Zn2 |
Title of publication | The influence of linker substitution on the fluorescence responsive sensing of isostructural coordination polymers: visual turn-on, ratiometric, and turn-off sensing in water |
Authors of publication | Chuang, Po-Min; Huang, Yun-Wen; Liu, Yu-Lin; Wu, Jing-Yun |
Journal of publication | CrystEngComm |
Year of publication | 2021 |
Journal volume | 23 |
Journal issue | 11 |
Pages of publication | 2222 - 2234 |
a | 24.379 ± 0.002 Å |
b | 18.81 ± 0.002 Å |
c | 15.0638 ± 0.0013 Å |
α | 90° |
β | 104.484 ± 0.004° |
γ | 90° |
Cell volume | 6688.2 ± 1.1 Å3 |
Cell temperature | 150 ± 2 K |
Ambient diffraction temperature | 150 ± 2 K |
Number of distinct elements | 6 |
Space group number | 15 |
Hermann-Mauguin space group symbol | C 1 2/c 1 |
Hall space group symbol | -C 2yc |
Residual factor for all reflections | 0.1176 |
Residual factor for significantly intense reflections | 0.077 |
Weighted residual factors for significantly intense reflections | 0.1804 |
Weighted residual factors for all reflections included in the refinement | 0.2069 |
Goodness-of-fit parameter for all reflections included in the refinement | 1.119 |
Diffraction radiation wavelength | 0.71073 Å |
Diffraction radiation type | MoKα |