Information card for entry 7242264
Formula | C37 H27.5 Br1.5 N3 O7.5 Zn2 |
Calculated formula | C37 H26.5 Br1.5 N3 O7.5 Zn2 |
Title of publication | The influence of linker substitution on the fluorescence responsive sensing of isostructural coordination polymers: visual turn-on, ratiometric, and turn-off sensing in water |
Authors of publication | Chuang, Po-Min; Huang, Yun-Wen; Liu, Yu-Lin; Wu, Jing-Yun |
Journal of publication | CrystEngComm |
Year of publication | 2021 |
Journal volume | 23 |
Journal issue | 11 |
Pages of publication | 2222 - 2234 |
a | 24.8175 ± 0.0017 Å |
b | 19.1673 ± 0.0017 Å |
c | 15.1781 ± 0.0011 Å |
α | 90° |
β | 106.266 ± 0.004° |
γ | 90° |
Cell volume | 6931 ± 0.9 Å3 |
Cell temperature | 150 ± 2 K |
Ambient diffraction temperature | 150 ± 2 K |
Number of distinct elements | 6 |
Space group number | 15 |
Hermann-Mauguin space group symbol | C 1 2/c 1 |
Hall space group symbol | -C 2yc |
Residual factor for all reflections | 0.089 |
Residual factor for significantly intense reflections | 0.0719 |
Weighted residual factors for significantly intense reflections | 0.1665 |
Weighted residual factors for all reflections included in the refinement | 0.1826 |
Goodness-of-fit parameter for all reflections included in the refinement | 1.067 |
Diffraction radiation wavelength | 0.71073 Å |
Diffraction radiation type | MoKα |