Information card for entry 7242266
Formula | C16 H16 Cl N O Pd Te |
Calculated formula | C16 H16 Cl N O Pd Te |
Title of publication | Catalytically active nanosized Pd9Te4 (telluropalladinite) and PdTe (kotulskite) alloys: first precursor-architecture controlled synthesis using palladium complexes of organotellurium compounds as single source precursors |
Authors of publication | Arora, Aayushi; Oswal, Preeti; Rao, Gyandshwar K.; Kumar, Sushil; Singh, Ajai K.; Kumar, Arun |
Journal of publication | RSC Advances |
Year of publication | 2021 |
Journal volume | 11 |
Journal issue | 13 |
Pages of publication | 7214 - 7224 |
a | 16.7218 ± 0.0002 Å |
b | 19.244 ± 0.0003 Å |
c | 20.251 ± 0.0003 Å |
α | 90° |
β | 99.659 ± 0.001° |
γ | 90° |
Cell volume | 6424.28 ± 0.16 Å3 |
Cell temperature | 150 ± 0.1 K |
Ambient diffraction temperature | 150 ± 0.1 K |
Number of distinct elements | 7 |
Space group number | 14 |
Hermann-Mauguin space group symbol | P 1 21/n 1 |
Hall space group symbol | -P 2yn |
Residual factor for all reflections | 0.0444 |
Residual factor for significantly intense reflections | 0.0331 |
Weighted residual factors for significantly intense reflections | 0.0739 |
Weighted residual factors for all reflections included in the refinement | 0.0841 |
Goodness-of-fit parameter for all reflections included in the refinement | 1.0431 |
Diffraction radiation probe | x-ray |
Diffraction radiation wavelength | 0.71073 Å |
Diffraction radiation type | MoKα |