Information card for entry 7242267
Formula | C8 H11 Cl2 N Pd Te |
Calculated formula | C8 H11 Cl2 N Pd Te |
SMILES | [Te](c1ccccc1)CC[NH2][Pd](Cl)Cl |
Title of publication | Catalytically active nanosized Pd9Te4 (telluropalladinite) and PdTe (kotulskite) alloys: first precursor-architecture controlled synthesis using palladium complexes of organotellurium compounds as single source precursors |
Authors of publication | Arora, Aayushi; Oswal, Preeti; Rao, Gyandshwar K.; Kumar, Sushil; Singh, Ajai K.; Kumar, Arun |
Journal of publication | RSC Advances |
Year of publication | 2021 |
Journal volume | 11 |
Journal issue | 13 |
Pages of publication | 7214 - 7224 |
a | 7.9079 ± 0.0008 Å |
b | 8.4514 ± 0.001 Å |
c | 8.5568 ± 0.0007 Å |
α | 83.934 ± 0.008° |
β | 87.438 ± 0.008° |
γ | 86.644 ± 0.009° |
Cell volume | 567.27 ± 0.1 Å3 |
Cell temperature | 293 ± 2 K |
Ambient diffraction temperature | 293 ± 2 K |
Number of distinct elements | 6 |
Space group number | 2 |
Hermann-Mauguin space group symbol | P -1 |
Hall space group symbol | -P 1 |
Residual factor for all reflections | 0.0478 |
Residual factor for significantly intense reflections | 0.0355 |
Weighted residual factors for significantly intense reflections | 0.0725 |
Weighted residual factors for all reflections included in the refinement | 0.0821 |
Goodness-of-fit parameter for all reflections included in the refinement | 1.059 |
Diffraction radiation wavelength | 0.71073 Å |
Diffraction radiation type | MoKα |