Information card for entry 7242272
Formula | C64 H68 Co4 N16 O82 S16 Si2 W24 |
Calculated formula | C64 H68 Co4 N16 O82 S16 Si2 W24 |
Title of publication | Multifunctional photoelectric sensors and catalysts for CO2RR and Cr(vi) solution based on a series of POM-based materials |
Authors of publication | Wang, Chen; Ying, Jun; Zhang, Xin-yue; Zhang, Bao-yue; Tian, Ai-xiang; Wang, Xiu-li |
Journal of publication | CrystEngComm |
Year of publication | 2021 |
Journal volume | 23 |
Journal issue | 12 |
Pages of publication | 2424 - 2431 |
a | 12.3151 ± 0.0019 Å |
b | 15.487 ± 0.002 Å |
c | 19.695 ± 0.003 Å |
α | 86.76 ± 0.004° |
β | 87.368 ± 0.004° |
γ | 69.774 ± 0.003° |
Cell volume | 3517.7 ± 0.9 Å3 |
Cell temperature | 296 ± 2 K |
Ambient diffraction temperature | 296.15 K |
Number of distinct elements | 8 |
Space group number | 2 |
Hermann-Mauguin space group symbol | P -1 |
Hall space group symbol | -P 1 |
Residual factor for all reflections | 0.1893 |
Residual factor for significantly intense reflections | 0.0707 |
Weighted residual factors for significantly intense reflections | 0.1381 |
Weighted residual factors for all reflections included in the refinement | 0.1806 |
Goodness-of-fit parameter for all reflections included in the refinement | 0.924 |
Diffraction radiation wavelength | 0.71073 Å |
Diffraction radiation type | MoKα |