Information card for entry 7242271
Formula | C44 H68 B Cu2 N16 O43 W12 |
Calculated formula | C44 H68 B Cu2 N16 O43 W12 |
Title of publication | Multifunctional photoelectric sensors and catalysts for CO2RR and Cr(vi) solution based on a series of POM-based materials |
Authors of publication | Wang, Chen; Ying, Jun; Zhang, Xin-yue; Zhang, Bao-yue; Tian, Ai-xiang; Wang, Xiu-li |
Journal of publication | CrystEngComm |
Year of publication | 2021 |
Journal volume | 23 |
Journal issue | 12 |
Pages of publication | 2424 - 2431 |
a | 24.4397 ± 0.0007 Å |
b | 14.9911 ± 0.0007 Å |
c | 23.8988 ± 0.0009 Å |
α | 90° |
β | 116.637 ± 0.001° |
γ | 90° |
Cell volume | 7826.7 ± 0.5 Å3 |
Cell temperature | 296.15 K |
Ambient diffraction temperature | 296.15 K |
Number of distinct elements | 7 |
Space group number | 15 |
Hermann-Mauguin space group symbol | C 1 2/c 1 |
Hall space group symbol | -C 2yc |
Residual factor for all reflections | 0.0354 |
Residual factor for significantly intense reflections | 0.0257 |
Weighted residual factors for significantly intense reflections | 0.0508 |
Weighted residual factors for all reflections included in the refinement | 0.0534 |
Goodness-of-fit parameter for all reflections included in the refinement | 1.03 |
Diffraction radiation wavelength | 0.71073 Å |
Diffraction radiation type | MoKα |