Information card for entry 7242362
Formula | C17 H8 N5 Rb |
Calculated formula | C17 H8 N5 Rb |
Title of publication | Alkali metal salts of a tetracyanopyridine (TCPy) derivative: structure characterization and luminescence properties |
Authors of publication | Chunikhin, Sergey S.; Ershov, Oleg V.; Yatsenko, Alexandr V.; Tafeenko, Viktor A.; Dmitrieva, Natalia E.; Ievlev, Mikhail Yu. |
Journal of publication | CrystEngComm |
Year of publication | 2021 |
Journal volume | 23 |
Journal issue | 15 |
Pages of publication | 2816 - 2824 |
a | 22.0886 ± 0.0019 Å |
b | 8.7859 ± 0.0004 Å |
c | 20.308 ± 0.001 Å |
α | 90° |
β | 127.702 ± 0.005° |
γ | 90° |
Cell volume | 3118.2 ± 0.4 Å3 |
Cell temperature | 295 ± 2 K |
Ambient diffraction temperature | 295 K |
Number of distinct elements | 4 |
Space group number | 15 |
Hermann-Mauguin space group symbol | C 1 2/c 1 |
Hall space group symbol | -C 2yc |
Residual factor for all reflections | 0.0574 |
Residual factor for significantly intense reflections | 0.0313 |
Weighted residual factors for significantly intense reflections | 0.0679 |
Weighted residual factors for all reflections included in the refinement | 0.0746 |
Goodness-of-fit parameter for all reflections included in the refinement | 0.832 |
Diffraction radiation wavelength | 1.54186 Å |
Diffraction radiation type | CuKα |