Information card for entry 7242363
Formula | C38 H22 K2 N12 |
Calculated formula | C38 H22 K2 N12 |
Title of publication | Alkali metal salts of a tetracyanopyridine (TCPy) derivative: structure characterization and luminescence properties |
Authors of publication | Chunikhin, Sergey S.; Ershov, Oleg V.; Yatsenko, Alexandr V.; Tafeenko, Viktor A.; Dmitrieva, Natalia E.; Ievlev, Mikhail Yu. |
Journal of publication | CrystEngComm |
Year of publication | 2021 |
Journal volume | 23 |
Journal issue | 15 |
Pages of publication | 2816 - 2824 |
a | 20.608 ± 0.0005 Å |
b | 7.2325 ± 0.0002 Å |
c | 23.9944 ± 0.0005 Å |
α | 90° |
β | 90° |
γ | 90° |
Cell volume | 3576.3 ± 0.15 Å3 |
Cell temperature | 295 ± 2 K |
Ambient diffraction temperature | 295 K |
Number of distinct elements | 4 |
Space group number | 33 |
Hermann-Mauguin space group symbol | P n a 21 |
Hall space group symbol | P 2c -2n |
Residual factor for all reflections | 0.1611 |
Residual factor for significantly intense reflections | 0.0736 |
Weighted residual factors for significantly intense reflections | 0.1604 |
Weighted residual factors for all reflections included in the refinement | 0.198 |
Goodness-of-fit parameter for all reflections included in the refinement | 0.807 |
Diffraction radiation wavelength | 1.54186 Å |
Diffraction radiation type | CuKα |